Target
Adenosine receptor A3
Ligand
BDBM50138714
Substrate
Meas. Tech.
ChEMBL_1550081 (CHEMBL3756027)
Ki
2.4±n/a nM
Citation
 Squarcialupi, LCatarzi, DVarano, FBetti, MFalsini, MVincenzi, FRavani, ACiancetta, AVarani, KMoro, SColotta, V Structural refinement of pyrazolo[4,3-d]pyrimidine derivatives to obtain highly potent and selective antagonists for the human A3 adenosine receptor. Eur J Med Chem 108:117-33 (2016)  
Target
Name:
Adenosine receptor A3
Synonyms:
A3 adenosine receptor (hA3) ADORA3 | Adenosine A3 receptor (A3AR)
Type:
G Protein-Coupled Receptor (GPCR)
Mol. Mass.:
36197.32
Organism:
Homo sapiens (Human)
Description:
P0DMS8
Residue:
318
  
Inhibitor
Name:
BDBM50138714
Synonyms:
CHEMBL3752862
Type:
Small organic molecule
Emp. Form.:
C20H13N5OS2
Mol. Mass.:
403.48
SMILES:
O=C(Nc1nc(nc2cn(nc12)-c1ccccc1)-c1cccs1)c1cccs1
: