Target
Mitogen-activated protein kinase 1
Ligand
BDBM50375654
Substrate
Meas. Tech.
ChEMBL_1549980 (CHEMBL3755278)
IC50
1200±n/a nM
Citation
 Kinoshita, TSugiyama, HMori, YTakahashi, NTomonaga, A Identification of allosteric ERK2 inhibitors through in silico biased screening and competitive binding assay. Bioorg Med Chem Lett 26:955-8 (2016)  
Target
Name:
Mitogen-activated protein kinase 1
Synonyms:
ERK2 Extracellular signal-regulated kinase 2 Extracellular signal-regulated kinase 2 (ERK2) MAPK 2 MK01_HUMAN Mitogen-activated protein kinase 1 (ERK-2) Mitogen-activated protein kinase 2 PRKM2 | p42-MAPK
Type:
Ser/Thr Protein Kinase
Mol. Mass.:
41392.76
Organism:
Homo sapiens (Human)
Description:
P28482
Residue:
360
  
Inhibitor
Name:
BDBM50375654
Synonyms:
CHEMBL99203 | US11633415, Compound 5-iodotubercidin
Type:
Small organic molecule
Emp. Form.:
C11H13IN4O4
Mol. Mass.:
392.1498
SMILES:
Nc1ncnc2n(cc(I)c12)[C@@H]1O[C@H](CO)[C@@H](O)[C@H]1O
: