Target
L-lactate dehydrogenase B chain
Ligand
BDBM50010444
Substrate
Meas. Tech.
ChEMBL_1555231 (CHEMBL3768757)
Ki
39000±n/a nM
Citation
 Rani, RKumar, V Recent Update on Human Lactate Dehydrogenase Enzyme 5 (hLDH5) Inhibitors: A Promising Approach for Cancer Chemotherapy. J Med Chem 59:487-96 (2016)  
Target
Name:
L-lactate dehydrogenase B chain
Synonyms:
L-lactate dehydrogenase B LDH heart subunit LDH-H LDHB_HUMAN Renal carcinoma antigen NY-REN-46
Type:
Oxidoreductase; homotetramer
Mol. Mass.:
36635.55
Organism:
Homo sapiens (Human)
Description:
Residue:
334
  
Inhibitor
Name:
BDBM50010444
Synonyms:
CHEMBL52639 | Pentanoic acid 8,8'-dicyano-6,7,6',7'-tetrahydroxy-5,5'-diisopropyl-3,3'-dimethyl-1'-pentanoyloxy-[2,2']binaphthalenyl-1-yl ester
Type:
Small organic molecule
Emp. Form.:
C40H44N2O8
Mol. Mass.:
680.786
SMILES:
CCCCC(=O)Oc1c(c(C)cc2c(C(C)C)c(O)c(O)c(C#N)c12)-c1c(C)cc2c(C(C)C)c(O)c(O)c(C#N)c2c1OC(=O)CCCC
: