Target
L-lactate dehydrogenase A chain
Ligand
BDBM50144748
Substrate
Meas. Tech.
ChEMBL_1555230 (CHEMBL3768756)
IC50
63±n/a nM
Citation
 Rani, RKumar, V Recent Update on Human Lactate Dehydrogenase Enzyme 5 (hLDH5) Inhibitors: A Promising Approach for Cancer Chemotherapy. J Med Chem 59:487-96 (2016)  
Target
Name:
L-lactate dehydrogenase A chain
Synonyms:
Cell proliferation-inducing gene 19 protein L-lactate dehydrogenase A Chain LDH-A LDHA Lactate dehydrogenase A (LDHA) | Renal carcinoma antigen NY-REN-59
Type:
Protein
Mol. Mass.:
36694.85
Organism:
Homo sapiens (Human)
Description:
P00338::PDB Code: 4ajp
Residue:
332
  
Inhibitor
Name:
BDBM50144748
Synonyms:
CHEMBL3764412
Type:
Small organic molecule
Emp. Form.:
C28H29N5O5
Mol. Mass.:
515.5604
SMILES:
COc1ncc(c(OC)n1)-c1ccc2c(Nc3cc(cc(c3)C(O)=O)C(C)C(C)C)c(cnc2c1)C(N)=O
: