Target
L-lactate dehydrogenase B chain
Ligand
BDBM50144758
Substrate
Meas. Tech.
ChEMBL_1555231 (CHEMBL3768757)
IC50
220±n/a nM
Citation
 Rani, RKumar, V Recent Update on Human Lactate Dehydrogenase Enzyme 5 (hLDH5) Inhibitors: A Promising Approach for Cancer Chemotherapy. J Med Chem 59:487-96 (2016)  
Target
Name:
L-lactate dehydrogenase B chain
Synonyms:
L-lactate dehydrogenase B LDH heart subunit LDH-H LDHB_HUMAN Renal carcinoma antigen NY-REN-46
Type:
Oxidoreductase; homotetramer
Mol. Mass.:
36635.55
Organism:
Homo sapiens (Human)
Description:
Residue:
334
  
Inhibitor
Name:
BDBM50144758
Synonyms:
CHEMBL3765327
Type:
Small organic molecule
Emp. Form.:
C30H31N5O6S
Mol. Mass.:
589.662
SMILES:
COc1ncc(-c2ccc3c(Nc4cc(cc(c4)C(O)=O)C4CCCC4)c(cnc3c2)S(=O)(=O)NC2CC2)c(OC)n1
: