Target
L-lactate dehydrogenase A chain
Ligand
BDBM50144758
Substrate
Meas. Tech.
ChEMBL_1555230 (CHEMBL3768756)
IC50
16±n/a nM
Citation
 Rani, RKumar, V Recent Update on Human Lactate Dehydrogenase Enzyme 5 (hLDH5) Inhibitors: A Promising Approach for Cancer Chemotherapy. J Med Chem 59:487-96 (2016)  
Target
Name:
L-lactate dehydrogenase A chain
Synonyms:
Cell proliferation-inducing gene 19 protein L-lactate dehydrogenase A Chain LDH-A LDHA Lactate dehydrogenase A (LDHA) | Renal carcinoma antigen NY-REN-59
Type:
Protein
Mol. Mass.:
36694.85
Organism:
Homo sapiens (Human)
Description:
P00338::PDB Code: 4ajp
Residue:
332
  
Inhibitor
Name:
BDBM50144758
Synonyms:
CHEMBL3765327
Type:
Small organic molecule
Emp. Form.:
C30H31N5O6S
Mol. Mass.:
589.662
SMILES:
COc1ncc(-c2ccc3c(Nc4cc(cc(c4)C(O)=O)C4CCCC4)c(cnc3c2)S(=O)(=O)NC2CC2)c(OC)n1
: