Target
Cyclin-dependent kinase 2/G1/S-specific cyclin-E1
Ligand
BDBM6332
Substrate
Meas. Tech.
ChEBML_1555977
IC50
4365±n/a nM
Citation
 Baltus, CBJorda, RMarot, CBerka, KBazgier, VKry?tof, VPrié, GViaud-Massuard, MC Synthesis, biological evaluation and molecular modeling of a novel series of 7-azaindole based tri-heterocyclic compounds as potent CDK2/Cyclin E inhibitors. Eur J Med Chem 108:701-19 (2016)  
Target
Name:
Cyclin-dependent kinase 2/G1/S-specific cyclin-E1
Synonyms:
CDK2/CycE CDK2/E Cyclin-Dependent Kinase 2 (CDK2) Cyclin-dependent kinase 2/cyclin E1
Type:
Protein
Mol. Mass.:
Description:
Components:
This complex has 2 components.
Component 1
Name:
Cyclin-dependent kinase 2
Synonyms:
CDK2 CDK2_HUMAN Cell division protein kinase 2 Protein cereblon/Cyclin-dependent kinase 2 | p33 protein kinase
Type:
Enzyme Subunit
Mol. Mass.:
33938.17
Organism:
Homo sapiens (Human)
Description:
P24941
Residue:
298
  
Component 2
Name:
G1/S-specific cyclin-E1
Synonyms:
CCNE CCNE1_HUMAN
Type:
Enzyme Subunit
Mol. Mass.:
47073.17
Organism:
Homo sapiens (Human)
Description:
Residue:
410
  
Inhibitor
Name:
BDBM6332
Synonyms:
2-Aminoquinazoline 10 | 7-methoxy-N-[4-(morpholin-4-yl)phenyl]-8-(propan-2-yl)quinazolin-2-amine
Type:
Small organic molecule
Emp. Form.:
C22H26N4O2
Mol. Mass.:
378.4674
SMILES:
COc1ccc2cnc(Nc3ccc(cc3)N3CCOCC3)nc2c1C(C)C
: