Target
Cyclin-dependent kinase 2/G1/S-specific cyclin-E1
Ligand
BDBM6786
Substrate
Meas. Tech.
ChEMBL_1555977 (CHEMBL3767485)
IC50
2884±n/a nM
Citation
 Baltus, CBJorda, RMarot, CBerka, KBazgier, VKry?tof, VPrié, GViaud-Massuard, MC Synthesis, biological evaluation and molecular modeling of a novel series of 7-azaindole based tri-heterocyclic compounds as potent CDK2/Cyclin E inhibitors. Eur J Med Chem 108:701-19 (2016)  
Target
Name:
Cyclin-dependent kinase 2/G1/S-specific cyclin-E1
Synonyms:
CDK2/CycE CDK2/E Cyclin-Dependent Kinase 2 (CDK2) Cyclin-dependent kinase 2/cyclin E1
Type:
Protein
Mol. Mass.:
Description:
Components:
This complex has 2 components.
Component 1
Name:
Cyclin-dependent kinase 2
Synonyms:
CDK2 CDK2_HUMAN Cell division protein kinase 2 Protein cereblon/Cyclin-dependent kinase 2 | p33 protein kinase
Type:
Enzyme Subunit
Mol. Mass.:
33938.17
Organism:
Homo sapiens (Human)
Description:
P24941
Residue:
298
  
Component 2
Name:
G1/S-specific cyclin-E1
Synonyms:
CCNE CCNE1_HUMAN
Type:
Enzyme Subunit
Mol. Mass.:
47073.17
Organism:
Homo sapiens (Human)
Description:
Residue:
410
  
Inhibitor
Name:
BDBM6786
Synonyms:
8-bromo-18-methyl-3,13,18-triazahexacyclo[14.7.0.0^{2,10}.0^{4,9}.0^{11,15}.0^{17,21}]tricosa-1(16),2(10),4(9),5,7,11(15),17(21),19,22-nonaene-12,14-dione | indolo[6,7-a]pyrrolo[3,4-c]carbazole deriv. 3e
Type:
Small organic molecule
Emp. Form.:
C21H12BrN3O2
Mol. Mass.:
418.243
SMILES:
Cn1ccc2ccc3c4[nH]c5cccc(Br)c5c4c4C(=O)NC(=O)c4c3c12
: