Target
Adenosine receptor A1
Ligand
BDBM50139774
Substrate
Meas. Tech.
ChEBML_1553862
Ki
6037±n/a nM
Citation
 Zhou, GAslanian, RGallo, GKhan, TKuang, RPurakkattle, BDe Ruiz, MStamford, ATing, PWu, HWang, HXiao, DYu, TZhang, YMullins, DHodgson, R Discovery of aminoquinazoline derivatives as human A(2A) adenosine receptor antagonists. Bioorg Med Chem Lett 26:1348-54 (2016)  
Target
Name:
Adenosine receptor A1
Synonyms:
A1 adenosine receptor (hA1) AA1R_HUMAN ADORA1 Adenosine A1-receptor Adenosine receptor A1 (hA1) | Adenosine transporter (AdT)
Type:
G Protein-Coupled Receptor (GPCR)
Mol. Mass.:
36520.92
Organism:
Homo sapiens (Human)
Description:
P30542
Residue:
326
  
Inhibitor
Name:
BDBM50139774
Synonyms:
CHEMBL3764736
Type:
Small organic molecule
Emp. Form.:
C23H19N7O
Mol. Mass.:
409.4433
SMILES:
Cn1nccc1-c1cccc2c(nc(N)nc12)C(=O)NCc1cccc2cccnc12
: