Target
Adenosine receptor A1
Ligand
BDBM50139777
Substrate
Meas. Tech.
ChEBML_1553862
Ki
40±n/a nM
Citation
 Zhou, GAslanian, RGallo, GKhan, TKuang, RPurakkattle, BDe Ruiz, MStamford, ATing, PWu, HWang, HXiao, DYu, TZhang, YMullins, DHodgson, R Discovery of aminoquinazoline derivatives as human A(2A) adenosine receptor antagonists. Bioorg Med Chem Lett 26:1348-54 (2016)  
Target
Name:
Adenosine receptor A1
Synonyms:
A1 adenosine receptor (hA1) AA1R_HUMAN ADORA1 Adenosine A1-receptor Adenosine receptor A1 (hA1) | Adenosine transporter (AdT)
Type:
G Protein-Coupled Receptor (GPCR)
Mol. Mass.:
36520.92
Organism:
Homo sapiens (Human)
Description:
P30542
Residue:
326
  
Inhibitor
Name:
BDBM50139777
Synonyms:
CHEMBL3764260
Type:
Small organic molecule
Emp. Form.:
C19H13F2N5O
Mol. Mass.:
365.3362
SMILES:
Nc1nc(C(=O)NCc2cccc3cccnc23)c2cc(F)c(F)cc2n1
: