Target
Adenosine receptor A2a
Ligand
BDBM50139768
Substrate
Meas. Tech.
ChEBML_1553863
Ki
12±n/a nM
Citation
 Zhou, GAslanian, RGallo, GKhan, TKuang, RPurakkattle, BDe Ruiz, MStamford, ATing, PWu, HWang, HXiao, DYu, TZhang, YMullins, DHodgson, R Discovery of aminoquinazoline derivatives as human A(2A) adenosine receptor antagonists. Bioorg Med Chem Lett 26:1348-54 (2016)  
Target
Name:
Adenosine receptor A2a
Synonyms:
AA2AR_RAT Adenosine A2 receptor Adenosine Receptors A2a (A2a) Adenosine receptors A2a Rat striatal adenosine A2a receptor
Type:
G Protein-Coupled Receptor (GPCR)
Mol. Mass.:
45015.65
Organism:
Rattus norvegicus (rat)
Description:
Rat A2A receptors expressed in CHO cells.
Residue:
410
  
Inhibitor
Name:
BDBM50139768
Synonyms:
CHEMBL3763806 | US10138212, Example 94
Type:
Small organic molecule
Emp. Form.:
C20H17N5OS
Mol. Mass.:
375.447
SMILES:
CSc1cccc2c(nc(N)nc12)C(=O)NCc1cccc2cccnc12
: