Target
5-hydroxytryptamine receptor 2A
Ligand
BDBM50001915
Substrate
Meas. Tech.
ChEMBL_1547212 (CHEMBL3756319)
Ki
273±n/a nM
Citation
 Éliás, ONógrádi, KDomány, GSzakács, ZKóti, JSzántay, CTarcsay, ÁKeseru, GMGere, AKiss, BKurkó, DKolok, SNémethy, ZKapui, ZHellinger, ÉVastag, MSághy, KKedves, RGyertyán, I The influence of 5-HT(2A) activity on a 5-HT(2C) specific in vivo assay used for early identification of multiple acting SERT and 5-HT(2C) receptor ligands. Bioorg Med Chem Lett 26:914-20 (2016)  
Target
Name:
5-hydroxytryptamine receptor 2A
Synonyms:
5-HT-2 5-HT2A 5-hydroxytryptamine receptor 2A (5HT-2A) 5HT2A_HUMAN HTR2A | Serotonin receptor 2A
Type:
undefined
Mol. Mass.:
52607.65
Organism:
Homo sapiens (Human)
Description:
P28223
Residue:
471
  
Inhibitor
Name:
BDBM50001915
Synonyms:
1-(3-chlorophenyl)piperazine m-Chlorophenylpiperazine | mCPP
Type:
Small organic molecule
Emp. Form.:
C10H13ClN2
Mol. Mass.:
196.677
SMILES:
Clc1cccc(c1)N1CCNCC1
: