Target
S-adenosylhomocysteine hydrolase-like protein 1
Ligand
BDBM50140076
Substrate
Meas. Tech.
ChEMBL_1547422 (CHEMBL3757541)
IC50
>10000±n/a nM
Citation
 Liu, CChen, QSchneller, SW Enantiomeric 3-deaza-1',6'-isoneplanocin and its 3-bromo analogue: Synthesis by the Ullmann reaction and their antiviral properties. Bioorg Med Chem Lett 26:928-30 (2016)  
Target
Name:
S-adenosylhomocysteine hydrolase-like protein 1
Synonyms:
AHCYL1 AdoHcyase 2 DCAL IP(3)Rs binding protein released with IP(3) SAHH2_HUMAN | XPVKONA
Type:
PROTEIN
Mol. Mass.:
58952.83
Organism:
Homo sapiens (Human)
Description:
ChEMBL_116703
Residue:
530
  
Inhibitor
Name:
BDBM50140076
Synonyms:
CHEMBL3753489
Type:
Small organic molecule
Emp. Form.:
C12H14N4O3
Mol. Mass.:
262.2646
SMILES:
Nc1nccc2n(cnc12)C1=C[C@@H](CO)[C@H](O)[C@@H]1O
: