Target
Neutral amino acid transporter B(0)
Ligand
BDBM50140131
Substrate
Meas. Tech.
ChEMBL_1547440 (CHEMBL3757559)
IC50
33800±n/a nM
Citation
 Schulte, MLKhodadadi, ABCuthbertson, MLSmith, JAManning, HC 2-Amino-4-bis(aryloxybenzyl)aminobutanoic acids: A novel scaffold for inhibition of ASCT2-mediated glutamine transport. Bioorg Med Chem Lett 26:1044-7 (2016)  
Target
Name:
Neutral amino acid transporter B(0)
Synonyms:
AAAT_HUMAN ASCT2 Baboon M7 virus receptor Neutral amino acid transporter B(0) RDR SLC1A5 Solute carrier family 1 member 5
Type:
PROTEIN
Mol. Mass.:
56592.12
Organism:
Homo sapiens (Human)
Description:
ChEMBL_109758
Residue:
541
  
Inhibitor
Name:
BDBM50140131
Synonyms:
CHEMBL3752249
Type:
Small organic molecule
Emp. Form.:
C30H28F2N2O4
Mol. Mass.:
518.5511
SMILES:
N[C@@H](CCN(Cc1ccccc1Oc1ccccc1F)Cc1ccccc1Oc1ccccc1F)C(O)=O
: