Target
Lysine-specific demethylase 6B
Ligand
BDBM50140571
Substrate
Meas. Tech.
ChEMBL_1548620 (CHEMBL3757620)
IC50
900±n/a nM
Citation
 Hu, JWang, XChen, LHuang, MTang, WZuo, JLiu, YCShi, ZLiu, RShen, JXiong, B Design and discovery of new pyrimidine coupled nitrogen aromatic rings as chelating groups of JMJD3 inhibitors. Bioorg Med Chem Lett 26:721-5 (2016)  
Target
Name:
Lysine-specific demethylase 6B
Synonyms:
JMJD3 Jumonji domain-containing protein 3 KDM6B_HUMAN Lysine demethylase 6B Lysine-specific demethylase 6B (KDM6B(JMJD3)) | Lysine-specific demethylase 6B (KDM6B)
Type:
Protein
Mol. Mass.:
176672.55
Organism:
Homo sapiens (Human)
Description:
O15054
Residue:
1643
  
Inhibitor
Name:
BDBM50140571
Synonyms:
CHEMBL3752294
Type:
Small organic molecule
Emp. Form.:
C19H21N7O2S
Mol. Mass.:
411.481
SMILES:
OC(=O)CCNc1nc(cc(n1)-c1nccs1)N1CCN(CC1)c1ccccn1
: