Target
Lysine-specific demethylase 6B
Ligand
BDBM50140572
Substrate
Meas. Tech.
ChEMBL_1548620 (CHEMBL3757620)
IC50
990±n/a nM
Citation
 Hu, JWang, XChen, LHuang, MTang, WZuo, JLiu, YCShi, ZLiu, RShen, JXiong, B Design and discovery of new pyrimidine coupled nitrogen aromatic rings as chelating groups of JMJD3 inhibitors. Bioorg Med Chem Lett 26:721-5 (2016)  
Target
Name:
Lysine-specific demethylase 6B
Synonyms:
JMJD3 Jumonji domain-containing protein 3 KDM6B_HUMAN Lysine demethylase 6B Lysine-specific demethylase 6B (KDM6B(JMJD3)) | Lysine-specific demethylase 6B (KDM6B)
Type:
Protein
Mol. Mass.:
176672.55
Organism:
Homo sapiens (Human)
Description:
O15054
Residue:
1643
  
Inhibitor
Name:
BDBM50140572
Synonyms:
CHEMBL3753199
Type:
Small organic molecule
Emp. Form.:
C19H19N5O2S
Mol. Mass.:
381.451
SMILES:
OC(=O)CCNc1nc(cc(n1)-c1nccs1)N1CCc2ccccc2C1
: