Target
Mu-type opioid receptor
Ligand
BDBM50299217
Substrate
Meas. Tech.
ChEMBL_1552638 (CHEMBL3762577)
Ki
0.016000±n/a nM
Citation
 Turnaturi, RAricò, GRonsisvalle, GParenti, CPasquinucci, L Multitarget opioid ligands in pain relief: New players in an old game. Eur J Med Chem 108:211-28 (2016)  
Target
Name:
Mu-type opioid receptor
Synonyms:
M-OR-1 MOR-1 MUOR1 Mu opiate receptor OPRM1 hMOP | mu-type opioid receptor isoform MOR-1
Type:
G Protein-Coupled Receptor (GPCR)
Mol. Mass.:
44789.51
Organism:
Homo sapiens (Human)
Description:
P35372
Residue:
400
  
Inhibitor
Name:
BDBM50299217
Synonyms:
(5R,8S,11S,14S)-14-((S)-2-amino-3-(4-hydroxyphenyl)propanamido)-8,11-dibenzyl-7,10,13-trioxo-1,3-dithia-6,9,12-triazacyclopentadecane-5-carboxamide | CHEMBL583066
Type:
Small organic molecule
Emp. Form.:
C34H40N6O6S2
Mol. Mass.:
692.848
SMILES:
N[C@@H](Cc1ccc(O)cc1)C(=O)N[C@@H]1CSCSC[C@H](NC(=O)[C@H](Cc2ccccc2)NC(=O)[C@H](Cc2ccccc2)NC1=O)C(N)=O
: