Target
Carbonic anhydrase 9
Ligand
BDBM50334361
Substrate
Meas. Tech.
ChEMBL_1551386 (CHEMBL3762507)
Ki
0.500000±n/a nM
Citation
 Lomelino, CLMahon, BPMcKenna, RCarta, FSupuran, CT Kinetic and X-ray crystallographic investigations on carbonic anhydrase isoforms I, II, IX and XII of a thioureido analog of SLC-0111. Bioorg Med Chem 24:976-81 (2016)  
Target
Name:
Carbonic anhydrase 9
Synonyms:
CA-IX CAH9_HUMAN Carbonic anhydrase 9 (CA IX) Carbonic anhydrase 9 precursor Carbonic anhydrase IX (CAIX) Carbonic anhydrases; II & IX MN RCC-associated antigen G250
Type:
Enzyme
Mol. Mass.:
49669.03
Organism:
Homo sapiens (Human)
Description:
Catalytic domain of human cloned isozyme was used in the assay
Residue:
459
  
Inhibitor
Name:
BDBM50334361
Synonyms:
4-(3-(2-isopropylphenyl)ureido)benzenesulfonamide 4-{([(2'-Isopropylphenyl)amino]carbonyl)amino}benzenesulfonamide | CHEMBL1615280
Type:
Small organic molecule
Emp. Form.:
C16H19N3O3S
Mol. Mass.:
333.405
SMILES:
CC(C)c1ccccc1NC(=O)Nc1ccc(cc1)S(N)(=O)=O
: