Target
Carbonic anhydrase 12
Ligand
BDBM50334354
Substrate
Meas. Tech.
ChEMBL_1551387 (CHEMBL3762508)
Ki
4.5±n/a nM
Citation
 Lomelino, CLMahon, BPMcKenna, RCarta, FSupuran, CT Kinetic and X-ray crystallographic investigations on carbonic anhydrase isoforms I, II, IX and XII of a thioureido analog of SLC-0111. Bioorg Med Chem 24:976-81 (2016)  
Target
Name:
Carbonic anhydrase 12
Synonyms:
CA-XII CAH12_HUMAN Carbonic anhydrase Carbonic anhydrase XII Carbonic anhydrase XII (CAXII) | Tumor antigen HOM-RCC-3.1.3
Type:
Enzyme
Mol. Mass.:
39456.00
Organism:
Homo sapiens (Human)
Description:
Catalytic domain of human cloned isozyme was used in the assay
Residue:
354
  
Inhibitor
Name:
BDBM50334354
Synonyms:
4-(3-(4-fluorophenyl)ureido)benzenesulfonamide 4-{[(4-fluorophenyl)carbamoyl]amino}benzenesulfonamide | CHEMBL1615281
Type:
Small organic molecule
Emp. Form.:
C13H12FN3O3S
Mol. Mass.:
309.316
SMILES:
NS(=O)(=O)c1ccc(NC(=O)Nc2ccc(F)cc2)cc1
: