Target
Type-2 angiotensin II receptor
Ligand
BDBM50145197
Substrate
Meas. Tech.
ChEMBL_1555129 (CHEMBL3768051)
Ki
12±n/a nM
Citation
 Sallander, JWallinder, CHallberg, AÅqvist, JGutiérrez-de-Terán, H Structural determinants of subtype selectivity and functional activity of angiotensin II receptors. Bioorg Med Chem Lett 26:1355-9 (2016)  
Target
Name:
Type-2 angiotensin II receptor
Synonyms:
AGTR2 AT2 Angiotensin II type 2 (AT-2) receptor Type-2 angiotensin II receptor
Type:
Enzyme Catalytic Domain
Mol. Mass.:
41201.61
Organism:
Homo sapiens (Human)
Description:
Angiotensin II, central 0 0::P50052
Residue:
363
  
Inhibitor
Name:
BDBM50145197
Synonyms:
CHEMBL3394207
Type:
Small organic molecule
Emp. Form.:
C25H31N3O4S
Mol. Mass.:
469.596
SMILES:
CCCCOC(=O)NS(=O)(=O)c1ccc(CC(C)C)cc1-c1cccc(Cn2ccnc2)c1
: