Target
Low-density lipoprotein receptor-related protein 6
Ligand
BDBM50145380
Substrate
Meas. Tech.
ChEMBL_1555558 (CHEMBL3768328)
IC50
4710±n/a nM
Citation
 Thysiadis, SMpousis, SAvramidis, NKatsamakas, SBalomenos, ARemelli, REfthimiopoulos, SSarli, V Discovery of novel phenoxazinone derivatives as DKK1/LRP6 interaction inhibitors: Synthesis, biological evaluation and structure-activity relationships. Bioorg Med Chem 24:1014-22 (2016)  
Target
Name:
Low-density lipoprotein receptor-related protein 6
Synonyms:
LRP-6 LRP6_HUMAN | Low-density lipoprotein receptor-related protein 6
Type:
PROTEIN
Mol. Mass.:
180387.57
Organism:
Homo sapiens (Human)
Description:
ChEMBL_116698
Residue:
1613
  
Inhibitor
Name:
BDBM50145380
Synonyms:
CHEMBL3765591
Type:
Small organic molecule
Emp. Form.:
C23H21N3O6
Mol. Mass.:
435.4293
SMILES:
COC(=O)c1c(Nc2ccc(OC)cc2)c(=O)c(O)c2oc3cc(ccc3nc12)N(C)C
: