Target
5-hydroxytryptamine receptor 1A
Ligand
BDBM50056031
Substrate
Meas. Tech.
ChEMBL_1556024 (CHEMBL3767883)
Ki
0.360000±n/a nM
Citation
 Fiorino, FCiano, AMagli, ESeverino, BCorvino, APerissutti, EFrecentese, FDi Vaio, PIzzo, AACapasso, RMassarelli, PNencini, CRossi, IKedzierska, EOrzelska-Gòrka, JBielenica, ASantagada, VCaliendo, G Synthesis, in vitro and in vivo pharmacological evaluation of serotoninergic ligands containing an isonicotinic nucleus. Eur J Med Chem 110:133-50 (2016)  
Target
Name:
5-hydroxytryptamine receptor 1A
Synonyms:
5-HT-1A 5-HT1A 5-hydroxytryptamine receptor 1A (5HT1A) 5ht1a Htr1a Serotonin 1a (5-HT1a) receptor/Adrenergic receptor alpha-1 | Serotonin receptor 1A
Type:
G Protein-Coupled Receptor (GPCR)
Mol. Mass.:
46445.29
Organism:
Rattus norvegicus (rat)
Description:
Binding assays were performed using rat hippocampal membranes.
Residue:
422
  
Inhibitor
Name:
BDBM50056031
Synonyms:
CHEMBL104593 | N-{2-[4-(2-Methoxy-phenyl)-piperazin-1-yl]-ethyl}-isonicotinamide
Type:
Small organic molecule
Emp. Form.:
C19H24N4O2
Mol. Mass.:
340.4195
SMILES:
COc1ccccc1N1CCN(CCNC(=O)c2ccncc2)CC1
: