Target
D(1A) dopamine receptor
Ligand
BDBM50145628
Substrate
Meas. Tech.
ChEMBL_1556020 (CHEMBL3767684)
Ki
>10000±n/a nM
Citation
 Fiorino, FCiano, AMagli, ESeverino, BCorvino, APerissutti, EFrecentese, FDi Vaio, PIzzo, AACapasso, RMassarelli, PNencini, CRossi, IKedzierska, EOrzelska-Gòrka, JBielenica, ASantagada, VCaliendo, G Synthesis, in vitro and in vivo pharmacological evaluation of serotoninergic ligands containing an isonicotinic nucleus. Eur J Med Chem 110:133-50 (2016)  
Target
Name:
D(1A) dopamine receptor
Synonyms:
DOPAMINE D1 Dopamine D1 high Dopamine receptor Dopamine1-like Drd1a
Type:
Enzyme Catalytic Domain
Mol. Mass.:
49429.75
Organism:
RAT
Description:
P18901
Residue:
446
  
Inhibitor
Name:
BDBM50145628
Synonyms:
CHEMBL3765231
Type:
Small organic molecule
Emp. Form.:
C18H21FN4O
Mol. Mass.:
328.3839
SMILES:
Fc1ccc(cc1)N1CCN(CCNC(=O)c2ccncc2)CC1
: