Target
D(2) dopamine receptor
Ligand
BDBM50145627
Substrate
Meas. Tech.
ChEMBL_1556019 (CHEMBL3767683)
Ki
>10000±n/a nM
Citation
 Fiorino, FCiano, AMagli, ESeverino, BCorvino, APerissutti, EFrecentese, FDi Vaio, PIzzo, AACapasso, RMassarelli, PNencini, CRossi, IKedzierska, EOrzelska-Gòrka, JBielenica, ASantagada, VCaliendo, G Synthesis, in vitro and in vivo pharmacological evaluation of serotoninergic ligands containing an isonicotinic nucleus. Eur J Med Chem 110:133-50 (2016)  
Target
Name:
D(2) dopamine receptor
Synonyms:
DOPAMINE D2 DOPAMINE D2 Short Dopamine D2 receptor Drd2
Type:
G Protein-Coupled Receptor (GPCR)
Mol. Mass.:
50931.60
Organism:
Rattus norvegicus (rat)
Description:
P61169
Residue:
444
  
Inhibitor
Name:
BDBM50145627
Synonyms:
CHEMBL3763812
Type:
Small organic molecule
Emp. Form.:
C18H21FN4O
Mol. Mass.:
328.3839
SMILES:
Fc1ccccc1N1CCN(CCNC(=O)c2ccncc2)CC1
: