Target
Carbonic anhydrase 12
Ligand
BDBM50146599
Substrate
Meas. Tech.
ChEMBL_1555759 (CHEMBL3766370)
Ki
0.580000±n/a nM
Citation
 Cornelio, BLaronze-Cochard, MCeruso, MFerraroni, MRance, GACarta, FKhlobystov, ANFontana, ASupuran, CTSapi, J 4-Arylbenzenesulfonamides as Human Carbonic Anhydrase Inhibitors (hCAIs): Synthesis by Pd Nanocatalyst-Mediated Suzuki-Miyaura Reaction, Enzyme Inhibition, and X-ray Crystallographic Studies. J Med Chem 59:721-32 (2016)  
Target
Name:
Carbonic anhydrase 12
Synonyms:
CA-XII CAH12_HUMAN Carbonic anhydrase Carbonic anhydrase XII Carbonic anhydrase XII (CAXII) | Tumor antigen HOM-RCC-3.1.3
Type:
Enzyme
Mol. Mass.:
39456.00
Organism:
Homo sapiens (Human)
Description:
Catalytic domain of human cloned isozyme was used in the assay
Residue:
354
  
Inhibitor
Name:
BDBM50146599
Synonyms:
CHEMBL3763192
Type:
Small organic molecule
Emp. Form.:
C15H17NO2S
Mol. Mass.:
275.366
SMILES:
CC(C)c1ccccc1-c1ccc(cc1)S(N)(=O)=O
: