Target
Carbonic anhydrase 12
Ligand
BDBM210937
Substrate
Meas. Tech.
ChEMBL_1555759 (CHEMBL3766370)
Ki
0.580000±n/a nM
Citation
 Cornelio, BLaronze-Cochard, MCeruso, MFerraroni, MRance, GACarta, FKhlobystov, ANFontana, ASupuran, CTSapi, J 4-Arylbenzenesulfonamides as Human Carbonic Anhydrase Inhibitors (hCAIs): Synthesis by Pd Nanocatalyst-Mediated Suzuki-Miyaura Reaction, Enzyme Inhibition, and X-ray Crystallographic Studies. J Med Chem 59:721-32 (2016)  
Target
Name:
Carbonic anhydrase 12
Synonyms:
CA-XII CAH12_HUMAN Carbonic anhydrase Carbonic anhydrase XII Carbonic anhydrase XII (CAXII) | Tumor antigen HOM-RCC-3.1.3
Type:
Enzyme
Mol. Mass.:
39456.00
Organism:
Homo sapiens (Human)
Description:
Catalytic domain of human cloned isozyme was used in the assay
Residue:
354
  
Inhibitor
Name:
BDBM210937
Synonyms:
4-(3-formylphenyl)-benzenesulfonamide (4e)
Type:
Small organic molecule
Emp. Form.:
C13H11NO3S
Mol. Mass.:
261.296
SMILES:
NS(=O)(=O)c1ccc(cc1)-c1cccc(C=O)c1
: