Target
Carbonic anhydrase 2
Ligand
BDBM10867
Substrate
Meas. Tech.
ChEMBL_1553894 (CHEMBL3767548)
Ki
75±n/a nM
Citation
 Vullo, DDe Luca, VDel Prete, SCarginale, VScozzafava, AOsman, SMAlOthman, ZCapasso, CSupuran, CT Sulfonamide inhibition studies of theż-carbonic anhydrase from the Antarctic bacterium Colwellia psychrerythraea. Bioorg Med Chem Lett 26:1253-9 (2016)  
Target
Name:
Carbonic anhydrase 2
Synonyms:
CA-II CAC Carbonate dehydratase II Carbonic anhydrase 2 (CA-II) Carbonic anhydrase C Carbonic anhydrase II (CA-II) Carbonic anhydrase II (hCA II) | Carbonic anhydrase isoenzyme II (hCA II)
Type:
Enzyme
Mol. Mass.:
29250.71
Organism:
Homo sapiens (Human)
Description:
P00918
Residue:
260
  
Inhibitor
Name:
BDBM10867
Synonyms:
4-amino-6-chlorobenzene-1,3-disulfonamide aromatic/heteroaromatic sulfonamide 12
Type:
Small organic molecule
Emp. Form.:
C6H8ClN3O4S2
Mol. Mass.:
285.728
SMILES:
Nc1cc(Cl)c(cc1S(N)(=O)=O)S(N)(=O)=O
: