Target
Carbonic anhydrase 2
Ligand
BDBM50147755
Substrate
Meas. Tech.
ChEMBL_1555888 (CHEMBL3767105)
Ki
10±n/a nM
Citation
 Alafeefy, AMCarta, FCeruso, MAl-Tamimi, AMAl-Kahtani, AASupuran, CT Development of 3-(4-aminosulphonyl)-phenyl-2-mercapto-3H-quinazolin-4-ones as inhibitors of carbonic anhydrase isoforms involved in tumorigenesis and glaucoma. Bioorg Med Chem 24:1402-7 (2016)  
Target
Name:
Carbonic anhydrase 2
Synonyms:
CA-II CAC Carbonate dehydratase II Carbonic anhydrase 2 (CA-II) Carbonic anhydrase C Carbonic anhydrase II (CA-II) Carbonic anhydrase II (hCA II) | Carbonic anhydrase isoenzyme II (hCA II)
Type:
Enzyme
Mol. Mass.:
29250.71
Organism:
Homo sapiens (Human)
Description:
P00918
Residue:
260
  
Inhibitor
Name:
BDBM50147755
Synonyms:
CHEMBL3764423
Type:
Small organic molecule
Emp. Form.:
C15H13N3O4S2
Mol. Mass.:
363.411
SMILES:
COc1ccc2c(c1)nc(S)n(-c1ccc(cc1)S(N)(=O)=O)c2=O
: