Target
Transcription intermediary factor 1-alpha
Ligand
BDBM50148471
Substrate
Meas. Tech.
ChEMBL_1558044 (CHEMBL3771488)
IC50
2450±n/a nM
Citation
 Bennett, JFedorov, OTallant, CMonteiro, OMeier, JGamble, VSavitsky, PNunez-Alonso, GAHaendler, BRogers, CBrennan, PEMüller, SKnapp, S Discovery of a Chemical Tool Inhibitor Targeting the Bromodomains of TRIM24 and BRPF. J Med Chem 59:1642-7 (2016)  
Target
Name:
Transcription intermediary factor 1-alpha
Synonyms:
6.3.2.- RING finger protein 82 RNF82 TIF1-alpha TIF1A_HUMAN Transcription intermediary factor 1-alpha | Tripartite motif-containing protein 24
Type:
PROTEIN
Mol. Mass.:
116839.55
Organism:
Homo sapiens (Human)
Description:
ChEMBL_107998
Residue:
1050
  
Inhibitor
Name:
BDBM50148471
Synonyms:
CHEMBL3771154
Type:
Small organic molecule
Emp. Form.:
C22H20ClN3O4S
Mol. Mass.:
457.93
SMILES:
Cc1cc(Cl)ccc1S(=O)(=O)Nc1cc2n(C)c(=O)n(C)c2cc1Oc1ccccc1
: