Target
Peregrin
Ligand
BDBM50148468
Substrate
Meas. Tech.
ChEMBL_1558045 (CHEMBL3771489)
IC50
290±n/a nM
Citation
 Bennett, JFedorov, OTallant, CMonteiro, OMeier, JGamble, VSavitsky, PNunez-Alonso, GAHaendler, BRogers, CBrennan, PEMüller, SKnapp, S Discovery of a Chemical Tool Inhibitor Targeting the Bromodomains of TRIM24 and BRPF. J Med Chem 59:1642-7 (2016)  
Target
Name:
Peregrin
Synonyms:
BR140 BRPF1_HUMAN Peregrin | Protein Br140
Type:
PROTEIN
Mol. Mass.:
137524.47
Organism:
Homo sapiens (Human)
Description:
ChEMBL_108054
Residue:
1214
  
Inhibitor
Name:
BDBM50148468
Synonyms:
CHEMBL3769887
Type:
Small organic molecule
Emp. Form.:
C23H23N3O6S
Mol. Mass.:
469.51
SMILES:
COc1ccc(cc1OC)S(=O)(=O)Nc1cc2n(C)c(=O)n(C)c2cc1Oc1ccccc1
: