Target
Rho-associated protein kinase 2
Ligand
BDBM50087135
Substrate
Meas. Tech.
ChEMBL_1556366 (CHEMBL3772097)
IC50
19±n/a nM
Citation
 Donegan, RKLieberman, RL Discovery of Molecular Therapeutics for Glaucoma: Challenges, Successes, and Promising Directions. J Med Chem 59:788-809 (2016)  
Target
Name:
Rho-associated protein kinase 2
Synonyms:
KIAA0619 ROCK2 Rho kinase 2 (ROCKII) Rho-associated protein kinase 2 (ROCK2) Rho-associated protein kinase 2/Transforming protein RhoA Rho-associated, coiled-coil-containing protein kinase II p164 ROCK-2
Type:
Protein
Mol. Mass.:
160885.43
Organism:
Homo sapiens (Human)
Description:
O75116
Residue:
1388
  
Inhibitor
Name:
BDBM50087135
Synonyms:
CHEMBL3426621
Type:
Small organic molecule
Emp. Form.:
C15H18FN3O2S
Mol. Mass.:
323.386
SMILES:
C[C@H]1CNCCCN1S(=O)(=O)c1cccc2cncc(F)c12
: