Target
Adenosine receptor A1
Ligand
BDBM50149595
Substrate
Meas. Tech.
ChEMBL_1558359 (CHEMBL3772951)
IC50
2.9±n/a nM
Citation
 Knight, AHemmings, JLWinfield, ILeuenberger, MFrattini, EFrenguelli, BGDowell, SJLochner, MLadds, G Discovery of Novel Adenosine Receptor Agonists That Exhibit Subtype Selectivity. J Med Chem 59:947-64 (2016)  
Target
Name:
Adenosine receptor A1
Synonyms:
A1 adenosine receptor (hA1) AA1R_HUMAN ADORA1 Adenosine A1-receptor Adenosine receptor A1 (hA1) | Adenosine transporter (AdT)
Type:
G Protein-Coupled Receptor (GPCR)
Mol. Mass.:
36520.92
Organism:
Homo sapiens (Human)
Description:
P30542
Residue:
326
  
Inhibitor
Name:
BDBM50149595
Synonyms:
CHEMBL3770664
Type:
Small organic molecule
Emp. Form.:
C22H30N6O4
Mol. Mass.:
442.5114
SMILES:
CCNC(=O)[C@H]1O[C@H]([C@H](O)[C@@H]1O)n1cnc2c(NC34CC5CC(CC(C5)C3)C4)ncnc12
: