Target
Lysine-specific demethylase 5C
Ligand
BDBM50152029
Substrate
Meas. Tech.
ChEMBL_1561972 (CHEMBL3778979)
IC50
23±n/a nM
Citation
 Bavetsias, VLanigan, RMRuda, GFAtrash, BMcLaughlin, MGTumber, AMok, NYLe Bihan, YVDempster, SBoxall, KJJeganathan, FHatch, SBSavitsky, PVelupillai, SKrojer, TEngland, KSSejberg, JThai, CDonovan, APal, AScozzafava, GBennett, JMKawamura, AJohansson, CSzykowska, AGileadi, CBurgess-Brown, NAvon Delft, FOppermann, UWalters, ZShipley, JRaynaud, FIWestaway, SMPrinjha, RKFedorov, OBurke, RSchofield, CJWestwood, IMBountra, CMüller, Svan Montfort, RLBrennan, PEBlagg, J 8-Substituted Pyrido[3,4-d]pyrimidin-4(3H)-one Derivatives As Potent, Cell Permeable, KDM4 (JMJD2) and KDM5 (JARID1) Histone Lysine Demethylase Inhibitors. J Med Chem 59:1388-409 (2016)  
Target
Name:
Lysine-specific demethylase 5C
Synonyms:
DXS1272E JARID1C KDM5C Lysine-specific demethylase 5C (KDM5C) Protein SmcX SMCX | XE169
Type:
PROTEIN
Mol. Mass.:
175691.17
Organism:
Homo sapiens (Human)
Description:
P41229
Residue:
1560
  
Inhibitor
Name:
BDBM50152029
Synonyms:
CHEMBL3775899
Type:
Small organic molecule
Emp. Form.:
C24H25ClN6O
Mol. Mass.:
448.948
SMILES:
Clc1ccc(CC2CCN(CCc3cnn(c3)-c3nccc4c3nc[nH]c4=O)CC2)cc1
: