Target
N-acylethanolamine-hydrolyzing acid amidase
Ligand
BDBM50151156
Substrate
Meas. Tech.
ChEMBL_1558879 (CHEMBL3772811)
IC50
17300±n/a nM
Citation
 Nuzzi, AFiasella, AOrtega, JAPagliuca, CPonzano, SPizzirani, DBertozzi, SMOttonello, GTarozzo, GReggiani, ABandiera, TBertozzi, FPiomelli, D Potenta-amino-ß-lactam carbamic acid ester as NAAA inhibitors. Synthesis and structure-activity relationship (SAR) studies. Eur J Med Chem 111:138-59 (2016)  
Target
Name:
N-acylethanolamine-hydrolyzing acid amidase
Synonyms:
ASAH-like protein Acid ceramidase-like protein N-acylsphingosine amidohydrolase-like NAAA PLT
Type:
Enzyme
Mol. Mass.:
40073.12
Organism:
Homo sapiens (Human)
Description:
Q02083
Residue:
359
  
Inhibitor
Name:
BDBM50151156
Synonyms:
CHEMBL3769863
Type:
Small organic molecule
Emp. Form.:
C16H28N2O3
Mol. Mass.:
296.4051
SMILES:
CC1(C)NC(=O)[C@@H]1NC(=O)OCCCCC1CCCCC1
: