Target
N-acylethanolamine-hydrolyzing acid amidase
Ligand
BDBM50151240
Substrate
Meas. Tech.
ChEBML_1558887
IC50
37±n/a nM
Citation
 Nuzzi, AFiasella, AOrtega, JAPagliuca, CPonzano, SPizzirani, DBertozzi, SMOttonello, GTarozzo, GReggiani, ABandiera, TBertozzi, FPiomelli, D Potenta-amino-ß-lactam carbamic acid ester as NAAA inhibitors. Synthesis and structure-activity relationship (SAR) studies. Eur J Med Chem 111:138-59 (2016)  
Target
Name:
N-acylethanolamine-hydrolyzing acid amidase
Synonyms:
ASAH-like protein Acid ceramidase-like protein N-acylsphingosine amidohydrolase-like NAAA PLT
Type:
Enzyme
Mol. Mass.:
40073.12
Organism:
Homo sapiens (Human)
Description:
Q02083
Residue:
359
  
Inhibitor
Name:
BDBM50151240
Synonyms:
CHEMBL3770558
Type:
Small organic molecule
Emp. Form.:
C12H22N2O3
Mol. Mass.:
242.3147
SMILES:
CCCCCCCCOC(=O)N[C@H]1CNC1=O
: