Target
5-hydroxytryptamine receptor 7
Ligand
BDBM50151301
Substrate
Meas. Tech.
ChEMBL_1559214 (CHEMBL3771917)
Ki
79±n/a nM
Citation
 Kucwaj-Brysz, KWarszycki, DPodlewska, SWitek, JWitek, KGonzález Izquierdo, ASatala, GLoza, MILubelska, ALatacz, GBojarski, AJCastro, MKiec-Kononowicz, KHandzlik, J Rational design in search for 5-phenylhydantoin selective 5-HT7R antagonists. Molecular modeling, synthesis and biological evaluation. Eur J Med Chem 112:258-69 (2016)  
Target
Name:
5-hydroxytryptamine receptor 7
Synonyms:
5-HT-7 5-HT7 5-HT7S 5HT7 HTR7 | Serotonin receptor 7
Type:
G Protein-Coupled Receptor (GPCR)
Mol. Mass.:
53573.08
Organism:
Homo sapiens (Human)
Description:
P34969
Residue:
479
  
Inhibitor
Name:
BDBM50151301
Synonyms:
CHEMBL3771222
Type:
Small organic molecule
Emp. Form.:
C30H33FN4O3
Mol. Mass.:
516.6064
SMILES:
CC1(NC(=O)N(CC(O)CN2CCN(CC2)C(c2ccccc2)c2ccccc2)C1=O)c1ccc(F)cc1
: