Target
D(2) dopamine receptor
Ligand
BDBM50151310
Substrate
Meas. Tech.
ChEMBL_1559213 (CHEMBL3771916)
Ki
715±n/a nM
Citation
 Kucwaj-Brysz, KWarszycki, DPodlewska, SWitek, JWitek, KGonzález Izquierdo, ASatala, GLoza, MILubelska, ALatacz, GBojarski, AJCastro, MKiec-Kononowicz, KHandzlik, J Rational design in search for 5-phenylhydantoin selective 5-HT7R antagonists. Molecular modeling, synthesis and biological evaluation. Eur J Med Chem 112:258-69 (2016)  
Target
Name:
D(2) dopamine receptor
Synonyms:
D(2) dopamine receptor DOPAMINE D2 Long DRD2 Dopamine D2 receptor Dopamine D2 receptor (D2R) Dopamine2-like | d2
Type:
Cell-surface receptors
Mol. Mass.:
50647.10
Organism:
Homo sapiens (Human)
Description:
P14416
Residue:
443
  
Inhibitor
Name:
BDBM50151310
Synonyms:
CHEMBL3302600
Type:
Small organic molecule
Emp. Form.:
C24H29FN4O4
Mol. Mass.:
456.5099
SMILES:
COc1ccccc1N1CCN(CC(O)CN2C(=O)NC(C)(C2=O)c2ccc(F)cc2)CC1
: