Target
B2 bradykinin receptor
Ligand
BDBM50146893
Substrate
Meas. Tech.
ChEMBL_1560590 (CHEMBL3777322)
IC50
34±n/a nM
Citation
 Dosa, PIAmin, EA Tactical Approaches to Interconverting GPCR Agonists and Antagonists. J Med Chem 59:810-40 (2016)  
Target
Name:
B2 bradykinin receptor
Synonyms:
B2 BRADYKININ B2R BK-2 receptor BKRB2_HUMAN | Bradykinin B2 receptor
Type:
Enzyme Catalytic Domain
Mol. Mass.:
44467.17
Organism:
Homo sapiens (Human)
Description:
B2 BRADYKININ BDKRB2 HUMAN::P30411
Residue:
391
  
Inhibitor
Name:
BDBM50146893
Synonyms:
4-{(E)-2-[({[2,4-Dichloro-3-(4-ethoxy-2-methyl-quinolin-8-yloxymethyl)-phenyl]-methyl-carbamoyl}-methyl)-carbamoyl]-vinyl}-N-methyl-benzamide; hydrochloride | CHEMBL555403
Type:
Small organic molecule
Emp. Form.:
C33H32Cl2N4O5
Mol. Mass.:
635.537
SMILES:
CCOc1cc(C)nc2c(OCc3c(Cl)ccc(N(C)C(=O)CNC(=O)\C=C\c4ccc(cc4)C(=O)NC)c3Cl)cccc12
: