Target
B2 bradykinin receptor
Ligand
BDBM50150940
Substrate
Meas. Tech.
ChEMBL_1560590 (CHEMBL3777322)
IC50
0.360000±n/a nM
Citation
 Dosa, PIAmin, EA Tactical Approaches to Interconverting GPCR Agonists and Antagonists. J Med Chem 59:810-40 (2016)  
Target
Name:
B2 bradykinin receptor
Synonyms:
B2 BRADYKININ B2R BK-2 receptor BKRB2_HUMAN | Bradykinin B2 receptor
Type:
Enzyme Catalytic Domain
Mol. Mass.:
44467.17
Organism:
Homo sapiens (Human)
Description:
B2 BRADYKININ BDKRB2 HUMAN::P30411
Residue:
391
  
Inhibitor
Name:
BDBM50150940
Synonyms:
CHEMBL3774617
Type:
Small organic molecule
Emp. Form.:
C41H34Cl2N6O4
Mol. Mass.:
745.652
SMILES:
CN(C(=O)CNC(=O)\C=C\c1ccc(\C=C\c2ccncc2)nc1)c1ccc(Cl)c(COc2cccc3c(OCc4ccccn4)cc(C)nc23)c1Cl
: