Target
Type-2 angiotensin II receptor
Ligand
BDBM50141059
Substrate
Meas. Tech.
ChEMBL_1560582 (CHEMBL3777314)
Ki
2.1±n/a nM
Citation
 Dosa, PIAmin, EA Tactical Approaches to Interconverting GPCR Agonists and Antagonists. J Med Chem 59:810-40 (2016)  
Target
Name:
Type-2 angiotensin II receptor
Synonyms:
AGTR2 AT2 Angiotensin II type 2 (AT-2) receptor Type-2 angiotensin II receptor
Type:
Enzyme Catalytic Domain
Mol. Mass.:
41201.61
Organism:
Homo sapiens (Human)
Description:
Angiotensin II, central 0 0::P50052
Residue:
363
  
Inhibitor
Name:
BDBM50141059
Synonyms:
CHEMBL289614 N-Butyloxycarbonyl-4'-(2-Ethyl-5,7-dimethyl-imidazo[4,5-b]pyridin-3-ylmethyl)-5-isobutyl-biphenyl-2-sulfonic acid amide
Type:
Small organic molecule
Emp. Form.:
C32H40N4O4S
Mol. Mass.:
576.749
SMILES:
CCCCOC(=O)NS(=O)(=O)c1ccc(CC(C)C)cc1-c1ccc(Cn2c(CC)nc3c(C)cc(C)nc23)cc1
: