Target
Histamine H3 receptor
Ligand
BDBM50150944
Substrate
Meas. Tech.
ChEMBL_1560578 (CHEMBL3777310)
Ki
182±n/a nM
Citation
 Dosa, PIAmin, EA Tactical Approaches to Interconverting GPCR Agonists and Antagonists. J Med Chem 59:810-40 (2016)  
Target
Name:
Histamine H3 receptor
Synonyms:
G-protein coupled receptor 97 HH3R HRH3 Histamine H3 receptor (H3) Histamine receptor (H3 and H4)
Type:
G Protein-Coupled Receptor (GPCR)
Mol. Mass.:
48691.47
Organism:
Homo sapiens (Human)
Description:
Binding assays were using CHO cells stably expressing hH3R receptors.
Residue:
445
  
Inhibitor
Name:
BDBM50150944
Synonyms:
CHEMBL153207
Type:
Small organic molecule
Emp. Form.:
C10H17N3
Mol. Mass.:
179.2621
SMILES:
C(Cc1c[nH]cn1)C1CCCNC1
: