Target
Liver carboxylesterase 1
Ligand
BDBM50130915
Substrate
Meas. Tech.
ChEMBL_1561177 (CHEMBL3777370)
IC50
140±n/a nM
Citation
 Zou, LWLi, YGWang, PZhou, KHou, JJin, QHao, DCGe, GBYang, L Design, synthesis, and structure-activity relationship study of glycyrrhetinic acid derivatives as potent and selective inhibitors against human carboxylesterase 2. Eur J Med Chem 112:280-8 (2016)  
Target
Name:
Liver carboxylesterase 1
Synonyms:
Acyl coenzyme A:cholesterol acyltransferase CES1 EST1_HUMAN Serine hydrolase (CES1)
Type:
Protein
Mol. Mass.:
62520.83
Organism:
Homo sapiens (Human)
Description:
Residue:
567
  
Inhibitor
Name:
BDBM50130915
Synonyms:
CHEBI:3122 | CHEMBL1231178
Type:
Small organic molecule
Emp. Form.:
C12H9N2O8P
Mol. Mass.:
340.1822
SMILES:
OP(=O)(Oc1ccc(cc1)[N+]([O-])=O)Oc1ccc(cc1)[N+]([O-])=O
: