Target
Cyclin-dependent kinase 5
Ligand
BDBM50154932
Substrate
Meas. Tech.
ChEMBL_1561740 (CHEMBL3777412)
IC50
5.0±n/a nM
Citation
 Vymetalová, LHavlícek, L?turc, ASkrá?ková, ZJorda, RPospí?il, TStrnad, MKry?tof, V 5-Substituted 3-isopropyl-7-[4-(2-pyridyl)benzyl]amino-1(2)H-pyrazolo[4,3-d]pyrimidines with anti-proliferative activity as potent and selective inhibitors of cyclin-dependent kinases. Eur J Med Chem 110:291-301 (2016)  
Target
Name:
Cyclin-dependent kinase 5
Synonyms:
CDK5 CDKN5 Cyclin-dependent kinase 5 (CDK5/ p25) Cyclin-dependent-like kinase 5 PSSALRE Tau protein kinase II catalytic subunit
Type:
Enzyme Subunit
Mol. Mass.:
33308.61
Organism:
Homo sapiens (Human)
Description:
Residue:
292
  
Inhibitor
Name:
BDBM50154932
Synonyms:
CHEMBL3774632
Type:
Small organic molecule
Emp. Form.:
C23H27N7O
Mol. Mass.:
417.5068
SMILES:
CC(O)CNc1nc(NCc2ccc(cc2)-c2ccccn2)c2[nH]nc(C(C)C)c2n1
: