Target
Aminopeptidase N
Ligand
BDBM50155290
Substrate
Meas. Tech.
ChEBML_1560521
IC50
449260±n/a nM
Citation
 Yang, LWang, PWu, JFYang, LMWang, RRPang, WLi, YGShen, YMZheng, YTLi, X Design, synthesis and anti-HIV-1 evaluation of hydrazide-based peptidomimetics as selective gelatinase inhibitors. Bioorg Med Chem 24:2125-36 (2016)  
Target
Name:
Aminopeptidase N
Synonyms:
AMPN_PIG AP-M Alanyl aminopeptidase Aminopeptidase N (APN) Microsomal aminopeptidase pAPN
Type:
Protein
Mol. Mass.:
108810.25
Organism:
Sus scrofa (Pig)
Description:
P15145
Residue:
963
  
Inhibitor
Name:
BDBM50155290
Synonyms:
CHEMBL3774656
Type:
Small organic molecule
Emp. Form.:
C18H15ClN4O2
Mol. Mass.:
354.79
SMILES:
Cc1nc2ccccc2n(CC(=O)N\N=C\c2ccc(Cl)cc2)c1=O
: