Target
Cannabinoid receptor 2
Ligand
BDBM50156100
Substrate
Meas. Tech.
ChEMBL_1565590 (CHEMBL3782259)
Ki
0.260000±n/a nM
Citation
 Mugnaini, CBrizzi, ALigresti, AAllarà, MLamponi, SVacondio, FSilva, CMor, MDi Marzo, VCorelli, F Investigations on the 4-Quinolone-3-carboxylic Acid Motif. 7. Synthesis and Pharmacological Evaluation of 4-Quinolone-3-carboxamides and 4-Hydroxy-2-quinolone-3-carboxamides as High Affinity Cannabinoid Receptor 2 (CB2R) Ligands with Improved Aqueous Solubility. J Med Chem 59:1052-67 (2016)  
Target
Name:
Cannabinoid receptor 2
Synonyms:
CANNABINOID CB2 CB2 CB2B CNR2_HUMAN Cannabinoid CB2 receptor Cannabinoid receptor 2 (CB2R) | hCB2
Type:
G Protein-Coupled Receptor (GPCR)
Mol. Mass.:
39690.94
Organism:
Homo sapiens (Human)
Description:
P34972
Residue:
360
  
Inhibitor
Name:
BDBM50156100
Synonyms:
CHEMBL3780550
Type:
Small organic molecule
Emp. Form.:
C28H38N2O2
Mol. Mass.:
434.6135
SMILES:
CCCCCn1c2ccc(cc2cc(C(=O)NC23CC4CC(CC(C4)C2)C3)c1=O)C(C)C
: