Target
Tyrosine-protein kinase JAK2
Ligand
BDBM50157311
Substrate
Meas. Tech.
ChEBML_1563965
Ki
9±n/a nM
Citation
 Bryan, MCBurdick, DJChan, BKChen, YClausen, SDotson, JEigenbrot, CElliott, RHanan, EJHeald, RJackson, PLa, HLainchbury, MMalek, SMann, SEPurkey, HESchaefer, GSchmidt, SSeward, ESideris, SWang, SYen, IYu, CHeffron, TP Pyridones as Highly Selective, Noncovalent Inhibitors of T790M Double Mutants of EGFR. ACS Med Chem Lett 7:100-4 (2016)  
Target
Name:
Tyrosine-protein kinase JAK2
Synonyms:
JAK-2 JAK2_HUMAN Janus kinase 2 (JAK2) | Janus kinase 2 (a protein tyrosine kinase)
Type:
Protein
Mol. Mass.:
130684.68
Organism:
Homo sapiens (Human)
Description:
O60674
Residue:
1132
  
Inhibitor
Name:
BDBM50157311
Synonyms:
CHEMBL3780090
Type:
Small organic molecule
Emp. Form.:
C24H27N5O3
Mol. Mass.:
433.5029
SMILES:
COc1ccccc1Nc1cc[nH]c(=O)c1C(=O)Nc1ccc(cc1)N1CCN(C)CC1
: