Target
Epidermal growth factor receptor
Ligand
BDBM50157324
Substrate
Meas. Tech.
ChEMBL_1563973 (CHEMBL3784892)
Ki
43±n/a nM
Citation
 Bryan, MCBurdick, DJChan, BKChen, YClausen, SDotson, JEigenbrot, CElliott, RHanan, EJHeald, RJackson, PLa, HLainchbury, MMalek, SMann, SEPurkey, HESchaefer, GSchmidt, SSeward, ESideris, SWang, SYen, IYu, CHeffron, TP Pyridones as Highly Selective, Noncovalent Inhibitors of T790M Double Mutants of EGFR. ACS Med Chem Lett 7:100-4 (2016)  
Target
Name:
Epidermal growth factor receptor
Synonyms:
EGF Receptor Substrate EGFR_HUMAN ERBB1 Epidermal Growth Factor Receptor erbB-1 Epidermal growth factor receptor (EGFR) HER1 Proto-oncogene c-ErbB-1 Tyrosine-Protein Kinase ErbB-1
Type:
Receptor Kinase Domain
Mol. Mass.:
134279.59
Organism:
Homo sapiens (Human)
Description:
P00533
Residue:
1210
  
Inhibitor
Name:
BDBM50157324
Synonyms:
CHEMBL3780037
Type:
Small organic molecule
Emp. Form.:
C25H28ClN5O2
Mol. Mass.:
465.975
SMILES:
CN1CCN(CC1)c1ccc(NC(=O)c2c(NCCc3cccc(Cl)c3)cc[nH]c2=O)cc1
: