Target
Bromodomain-containing protein 4
Ligand
BDBM50156342
Substrate
Meas. Tech.
ChEBML_1569661
IC50
<300±n/a nM
Citation
 Romero, FATaylor, AMCrawford, TDTsui, VCôté, AMagnuson, S Disrupting Acetyl-Lysine Recognition: Progress in the Development of Bromodomain Inhibitors. J Med Chem 59:1271-98 (2016)  
Target
Name:
Bromodomain-containing protein 4
Synonyms:
BRD4 Bromodomain-containing protein 4 (BRD4) Protein HUNK1
Type:
Protein
Mol. Mass.:
152264.84
Organism:
Homo sapiens (Human)
Description:
O60885
Residue:
1362
  
Inhibitor
Name:
BDBM50156342
Synonyms:
CHEMBL3786267
Type:
Small organic molecule
Emp. Form.:
C22H29N5O2
Mol. Mass.:
395.498
SMILES:
Cc1noc(C)c1-c1cnc2n(CC3CCCC3)c(NC3CCOCC3)nc2c1
: