Target
Bromodomain-containing protein 4
Ligand
BDBM50156344
Substrate
Meas. Tech.
ChEMBL_1569664 (CHEMBL3791137)
IC50
8±n/a nM
Citation
 Romero, FATaylor, AMCrawford, TDTsui, VCôté, AMagnuson, S Disrupting Acetyl-Lysine Recognition: Progress in the Development of Bromodomain Inhibitors. J Med Chem 59:1271-98 (2016)  
Target
Name:
Bromodomain-containing protein 4
Synonyms:
BRD4 Bromodomain-containing protein 4 (BRD4) Protein HUNK1
Type:
Protein
Mol. Mass.:
152264.84
Organism:
Homo sapiens (Human)
Description:
O60885
Residue:
1362
  
Inhibitor
Name:
BDBM50156344
Synonyms:
CHEMBL3787210
Type:
Small organic molecule
Emp. Form.:
C22H24N4O2S
Mol. Mass.:
408.517
SMILES:
Cc1noc(C)c1-c1ccc2NC(=O)C(N3CCC[C@H](N)C3)(c3ccsc3)c2c1
: