Target
Bromodomain-containing protein 4
Ligand
BDBM50157532
Substrate
Meas. Tech.
ChEMBL_1569655 (CHEMBL3791128)
IC50
<100±n/a nM
Citation
 Romero, FATaylor, AMCrawford, TDTsui, VCôté, AMagnuson, S Disrupting Acetyl-Lysine Recognition: Progress in the Development of Bromodomain Inhibitors. J Med Chem 59:1271-98 (2016)  
Target
Name:
Bromodomain-containing protein 4
Synonyms:
BRD4 Bromodomain-containing protein 4 (BRD4) Protein HUNK1
Type:
Protein
Mol. Mass.:
152264.84
Organism:
Homo sapiens (Human)
Description:
O60885
Residue:
1362
  
Inhibitor
Name:
BDBM50157532
Synonyms:
CHEMBL3785966
Type:
Small organic molecule
Emp. Form.:
C19H15ClN6
Mol. Mass.:
362.816
SMILES:
Cc1nnc2ccc3n(Cc4cccc(Cl)c4)c(cc3n12)-c1cnc[nH]1
: